{"text_format":"1","workbook":"xlsx","n_sheets":8,"sheets":["INVOICE","Customers","Articles","About me","Language","Language table","Data","Parametre"],"not_rendered":{"charts":0,"images":0,"macros":1,"external_links":0,"defined_names":2,"comments":0,"pivot_tables":0},"unopened":[],"bounds":{"document_bytes":16777216,"sheet_cells":100000,"rows_first":2000,"rows_last":500,"rows_between":2000,"halvings":0,"cell_chars":16384,"cell_head_chars":4096},"cells_cut":0,"cells_raw":0,"read":"whole","date_system":"1900"}

{"sheet":"INVOICE","index":0,"n_rows":49,"n_cols":34,"rows_kept":49,"cut":false,"hidden":false,"merged":[[23,17,23,19],[20,17,20,19],[21,17,21,19],[22,17,22,19],[6,23,6,25],[10,23,10,25],[11,23,11,25],[12,23,12,25],[13,23,13,25],[24,20,24,22],[25,20,25,22],[26,20,26,22],[1,20,1,25],[0,22,0,25],[2,22,2,25],[3,22,3,25],[5,24,5,25],[9,23,9,25],[8,23,8,25],[7,23,7,25],[27,20,27,22],[28,20,28,22],[19,20,19,22],[20,20,20,22],[21,20,21,22],[10,20,10,22],[11,17,11,19],[26,23,26,25],[39,23,39,25],[27,17,27,19],[28,17,28,19],[29,17,29,19],[36,23,36,25],[28,23,28,25],[24,23,24,25],[19,23,19,25],[14,23,14,25],[25,17,25,19],[26,17,26,19],[22,20,22,22],[23,20,23,22],[18,17,18,19],[19,17,19,19],[24,17,24,19],[40,23,40,25],[11,20,11,22],[12,20,12,22],[13,20,13,22],[14,20,14,22],[15,20,15,22],[16,20,16,22],[17,20,17,22],[18,20,18,22],[29,23,29,25],[15,23,15,25],[16,23,16,25],[17,23,17,25],[18,23,18,25],[20,23,20,25],[21,23,21,25],[22,23,22,25],[23,23,23,25],[25,23,25,25],[29,20,29,22],[30,20,30,22],[38,23,38,25],[27,23,27,25],[34,23,34,25],[29,15,29,16],[30,15,30,16],[10,17,10,19],[10,15,10,16],[11,15,11,16],[12,15,12,16],[13,15,13,16],[14,15,14,16],[15,15,15,16],[16,15,16,16],[17,15,17,16],[12,17,12,19],[13,17,13,19],[14,17,14,19],[15,17,15,19],[16,17,16,19],[17,17,17,19],[22,15,22,16],[23,15,23,16],[24,15,24,16],[25,15,25,16],[26,15,26,16],[18,15,18,16],[19,15,19,16],[20,15,20,16],[21,15,21,16],[28,12,28,14],[29,12,29,14],[30,12,30,14],[10,12,10,14],[12,12,12,14],[13,12,13,14],[14,12,14,14],[15,12,15,14],[27,12,27,14],[11,12,11,14],[16,12,16,14],[17,12,17,14],[18,12,18,14],[19,12,19,14],[20,12,20,14],[21,12,21,14],[22,12,22,14],[23,12,23,14],[27,15,27,16],[28,15,28,16],[24,12,24,14],[25,12,25,14],[10,10,10,11],[11,10,11,11],[12,10,12,11],[13,10,13,11],[14,10,14,11],[15,10,15,11],[16,10,16,11],[17,10,17,11],[18,10,18,11],[26,12,26,14],[19,10,19,11],[20,10,20,11],[21,10,21,11],[11,8,11,9],[12,8,12,9],[13,8,13,9],[14,8,14,9],[15,8,15,9],[16,8,16,9],[17,8,17,9],[18,8,18,9],[19,8,19,9],[23,8,23,9],[24,8,24,9],[25,8,25,9],[26,8,26,9],[20,8,20,9],[21,8,21,9],[22,8,22,9],[22,10,22,11],[23,10,23,11],[24,10,24,11],[25,10,25,11],[26,10,26,11],[27,1,27,7],[28,1,28,7],[29,1,29,7],[28,8,28,9],[29,8,29,9],[29,10,29,11],[27,8,27,9],[28,10,28,11],[27,10,27,11],[10,1,10,7],[11,1,11,7],[12,1,12,7],[13,1,13,7],[14,1,14,7],[15,1,15,7],[16,1,16,7],[17,1,17,7],[18,1,18,7],[19,1,19,7],[20,1,20,7],[21,1,21,7],[48,19,48,24],[39,17,39,19],[31,1,31,7],[31,8,31,9],[31,10,31,11],[31,12,31,14],[31,15,31,16],[31,17,31,19],[31,20,31,22],[31,23,31,25],[32,1,32,7],[32,8,32,9],[32,10,32,11],[32,12,32,14],[37,23,37,25],[46,3,46,8],[45,3,45,8],[37,1,37,7],[37,8,37,9],[38,1,38,7],[38,8,38,9],[33,1,33,7],[33,8,33,9],[37,10,37,11],[5,0,5,5],[6,0,6,5],[7,0,7,5],[8,0,8,5],[34,17,34,19],[34,20,34,22],[36,1,36,7],[36,8,36,9],[36,10,36,11],[36,12,36,14],[36,15,36,16],[36,17,36,19],[36,20,36,22],[34,1,34,7],[34,8,34,9],[30,1,30,7],[22,1,22,7],[23,1,23,7],[24,1,24,7],[25,1,25,7],[26,1,26,7],[37,12,37,14],[37,15,37,16],[37,17,37,19],[38,10,38,11],[38,12,38,14],[40,21,40,22],[37,20,37,22],[38,15,38,16],[38,17,38,19],[47,3,47,8],[38,20,38,22],[39,20,39,22],[40,17,40,19],[40,14,40,16],[39,14,39,16],[39,11,39,13],[40,11,40,13],[40,7,40,10],[39,7,39,10],[44,9,44,12],[35,1,35,7],[35,8,35,9],[35,10,35,11],[35,12,35,14],[35,15,35,16],[35,17,35,19],[35,20,35,22],[35,23,35,25],[34,10,34,11],[34,12,34,14],[34,15,34,16],[30,8,30,9],[32,15,32,16],[32,17,32,19],[32,20,32,22],[32,23,32,25],[33,10,33,11],[33,12,33,14],[33,15,33,16],[33,17,33,19],[33,20,33,22],[33,23,33,25],[30,17,30,19],[30,23,30,25],[30,10,30,11]]}
[{"$f":"'About me'!B1","v":"ExcelGuru.no"},null,null,null,null,null,null,null,null,null,null,null,null,null,null,null,null,null,{"$f":"txt(5,_InvLng)","v":"VAT nie"},null,null,null,{"$f":" 'About me'!$B$2","v":"123456789 MVA"},null,null,null,null,null,null,null,null,null,"*vat*"]
[{"$f":"'About me'!B5","v":"MyRoad 12"},null,null,null,null,null,null,null,null,null,null,null,null,null,null,null,null,null,null,null,{"$f":"'About me'!B3","v":"Foretaksregisteret"}]
[{"$f":"'About me'!B6 & \" \" & 'About me'!B7","v":"1781 Halden"},null,null,null,null,null,{"$f":"IF(G4<>\"\",txt(4,_InvLng),\"\")","v":"Nazwa Kontaktu"},null,null,null,null,null,null,null,null,null,null,null,{"$f":"txt(6,_InvLng)","v":"Komórka"},null,null,null,{"$f":"'About me'!B8","v":4799887766}]
[{"$f":"'About me'!B9","v":"ketil@excelguru.com"},null,null,null,null,null,{"$f":"'About me'!B4","v":"Ketil"},null,null,null,null,null,null,null,null,null,null,null,{"$f":"txt(7,_InvLng)","v":"konto bankowe"},null,null,null,{"$f":"'About me'!B10","v":"1234.55.67891"}]
[null,null,null,null,null,null,null,null,null,null,null,null,null,null,null,null,null,null,{"$f":"IF(X41>=0,txt(2,_InvLng),txt(3,_InvLng))","v":"FAKTURA"}]
["Polish handyman",null,null,null,null,null,null,0,null,null,null,null,null,null,null,null,null,null,{"$f":"txt(8,_InvLng)","v":"Numer klienta"},null,null,null,null,null,{"$f":"INDEX(Customers!A:A,MATCH(A6,Customers!B:B,))","v":1005}]
[{"$f":"IFERROR(VLOOKUP($Y$6,Customers!$A:$H,3,FALSE),\"\")","v":0},null,null,null,null,null,null,null,null,null,null,null,null,null,null,null,null,null,{"$f":"IF(X41>=0,txt(9,_InvLng),txt(10,_InvLng))","v":"Faktury nr"},null,null,null,null,{"$f":"Parametre!B1","v":1021}]
[{"$f":"IFERROR(TEXT(VLOOKUP($Y$6,Customers!$A:$H,5,FALSE),\"0000\")& \" \" & VLOOKUP($Y$6,Customers!$A:$H,6,FALSE),\"\")","v":"0000 "},null,null,null,null,null,{"$f":"txt(4,_InvLng)","v":"Nazwa Kontaktu"},null,null,null,null,null,null,null,null,null,null,null,{"$f":"txt(11,_InvLng)","v":"Data faktury"},null,null,null,null,{"$f":"TODAY()","v":"2021-09-07"}]
{"$rows_left_out":42}
{"sheet":"Customers","index":1,"n_rows":10,"n_cols":13,"rows_kept":10,"cut":false,"hidden":false,"merged":[]}
[{"$f":"txt(38,_Lng)","v":"Customer no"},{"$f":"txt(39,_Lng)","v":"Address 1"},{"$f":"txt(40,_Lng)","v":"Address 2"},{"$f":"txt(42,_Lng)","v":"Post no"},{"$f":"txt(43,_Lng)","v":"Place"},{"$f":"txt(69,_Lng)","v":"Country"},{"$f":"txt(44,_Lng)","v":"Contact person"},{"$f":"txt(45,_Lng)","v":"Email"},{"$f":"txt(46,_Lng)","v":"Due days"},{"$f":"txt(47,_Lng)","v":"Discount"},{"$f":"txt(68,_Lng)","v":"Language"},{"$f":"txt(64,_Lng)","v":"Currency"},{"$f":"txt(87,_Lng)","v":"Inactive"}]
[1001,"Excelguru","Ringveien 12",101,"Halden",null,"Bjarne","ketil@junkmail.com",14,0,"Norwegian","NOK"]
[1002,"Ola Nordmann","Kariveien 12",1890,"Tistedal",null,"Kurt","kurt@tullemail.no",14,0,"Norwegian","NOK"]
[1003,"Andersen  AS",null,1781,"Halden",null,"Ole","ole@tullemail.no",14,0,"Norwegian","NOK"]
[1004,"Bobby Englishman","Somewhere street",12345,"London","UK","Bill","bob@funnyaddress.com",14,5,"English","EUR"]
[1005,"Polish handyman",null,null,null,null,null,null,14,null,"Polish","EUR"]
[1006,"Svensken",null,null,null,null,null,null,14,null,"Swedish","SEK"]
[1007,"Mr. Russian",null,null,null,null,null,null,14,null,"Russian","RUB"]
{"$rows_left_out":3}
{"sheet":"Articles","index":2,"n_rows":6,"n_cols":46,"rows_kept":6,"cut":false,"hidden":false,"merged":[[0,42,0,45],[0,26,0,29],[0,30,0,33],[0,34,0,37],[0,38,0,41],[0,22,0,25],[0,0,0,5],[0,6,0,9],[0,10,0,13],[0,14,0,17],[0,18,0,21]]}
[{"$f":"INDIRECT(\"Parametre!E25\")","v":"English"},null,null,null,null,null,{"$f":"INDEX(Parametre!$E:$E,MATCH(A1,Parametre!$E$1:$E$41,0)+1)","v":"Norwegian"},null,null,null,{"$f":"INDEX(Parametre!$E:$E,MATCH(G1,Parametre!$E$1:$E$41,0)+1)","v":"Swedish"},null,null,null,{"$f":"INDEX(Parametre!$E:$E,MATCH(K1,Parametre!$E$1:$E$41,0)+1)","v":"Danish"},null,null,null,{"$f":"INDEX(Parametre!$E:$E,MATCH(O1,Parametre!$E$1:$E$41,0)+1)","v":"Finnish"},null,null,null,{"$f":"INDEX(Parametre!$E:$E,MATCH(S1,Parametre!$E$1:$E$41,0)+1)","v":"German"},null,null,null,{"$f":"INDEX(Parametre!$E:$E,MATCH(W1,Parametre!$E$1:$E$41,0)+1)","v":"Polish"},null,null,null,{"$f":"INDEX(Parametre!$E:$E,MATCH(AA1,Parametre!$E$1:$E$41,0)+1)","v":"Latvian"},null,null,null,{"$f":"INDEX(Parametre!$E:$E,MATCH(AE1,Parametre!$E$1:$E$41,0)+1)","v":"Lithuanian"},null,null,null,{"$f":"INDEX(Parametre!$E:$E,MATCH(AI1,Parametre!$E$1:$E$41,0)+1)","v":"Russian"},null,null,null,{"$f":"INDEX(Parametre!$E:$E,MATCH(AM1,Parametre!$E$1:$E$41,0)+1)","v":"Punjabi"}]
[{"$f":"txt(48,_Lng)","v":"Article no"},{"$f":"txt(49,_Lng)","v":"Description"},{"$f":"txt(50,_Lng)","v":"Unit"},{"$f":"txt(51,_Lng)","v":"Price"},{"$f":"txt(52,_Lng)","v":"VAT %"},{"$f":"txt(53,_Lng)","v":"Article discount"},{"$f":"txt(49,_Lng)","v":"Description"},{"$f":"txt(50,_Lng)","v":"Unit"},{"$f":"txt(51,_Lng)","v":"Price"},{"$f":"txt(52,_Lng)","v":"VAT %"},{"$f":"txt(49,_Lng)","v":"Description"},{"$f":"txt(50,_Lng)","v":"Unit"},{"$f":"txt(51,_Lng)","v":"Price"},{"$f":"txt(52,_Lng)","v":"VAT %"},{"$f":"txt(49,_Lng)","v":"Description"},{"$f":"txt(50,_Lng)","v":"Unit"},{"$f":"txt(51,_Lng)","v":"Price"},{"$f":"txt(52,_Lng)","v":"VAT %"},{"$f":"txt(49,_Lng)","v":"Description"},{"$f":"txt(50,_Lng)","v":"Unit"},{"$f":"txt(51,_Lng)","v":"Price"},{"$f":"txt(52,_Lng)","v":"VAT %"},{"$f":"txt(49,_Lng)","v":"Description"},{"$f":"txt(50,_Lng)","v":"Unit"},{"$f":"txt(51,_Lng)","v":"Price"},{"$f":"txt(52,_Lng)","v":"VAT %"},{"$f":"txt(49,_Lng)","v":"Description"},{"$f":"txt(50,_Lng)","v":"Unit"},{"$f":"txt(51,_Lng)","v":"Price"},{"$f":"txt(52,_Lng)","v":"VAT %"},{"$f":"txt(49,_Lng)","v":"Description"},{"$f":"txt(50,_Lng)","v":"Unit"},{"$f":"txt(51,_Lng)","v":"Price"},{"$f":"txt(52,_Lng)","v":"VAT %"},{"$f":"txt(49,_Lng)","v":"Description"},{"$f":"txt(50,_Lng)","v":"Unit"},{"$f":"txt(51,_Lng)","v":"Price"},{"$f":"txt(52,_Lng)","v":"VAT %"},{"$f":"txt(49,_Lng)","v":"Description"},{"$f":"txt(50,_Lng)","v":"Unit"},{"$f":"txt(51,_Lng)","v":"Price"},{"$f":"txt(52,_Lng)","v":"VAT %"},{"$f":"txt(49,_Lng)","v":"Description"},{"$f":"txt(50,_Lng)","v":"Unit"},{"$f":"txt(51,_Lng)","v":"Price"},{"$f":"txt(52,_Lng)","v":"VAT %"}]
[100,"Coaching","Hours",120,25,null,"Coaching","Timer",1200,null,"Coaching","timmar",990,null,null,null,null,null,null,null,null,null,"Coaching","Stunden",110,null,"Coaching","godzin",10,null,null,null,null,null,null,null,null,null,"тренировка","часов",11000,null,"ਕੋਚਿੰਗ","ਘੰਟੇ",11000]
[101,"Therapy","Hours",65,0,null,"Terapi","Time",650,null,"Terapix","timmar",1100,null,null,null,null,null,null,null,null,null,"Therapie","Stunde",65,null,"terapia","godzina",8,null,null,null,null,null,null,null,null,null,"терапия","час",6500,null,"ਥੇਰੇਪੀ","ਘੰਟੇ",6500]
[102,"Programming ","Hours",128,25,null,"Programmering","Timer",1280,25,"Programmering","timmar",1200,null,null,null,null,null,null,null,null,null,"Programmierung","Stunden",130,null,"programowanie","godzin",10,null,null,null,null,null,null,null,null,null,"программирование","часов",13000,null,"ਪ੍ਰੋਗਰਾਮਿੰਗ","ਘੰਟੇ",13000]
[103,"Pastry",null,1,null,null,"Bakevarer","Stk",25,null,null,null,null,null,null,null,null,null,null,null,null,null,"Gebäck",null,1,null,null,null,null,null,null,null,null,null,null,null,null,null,"печенье",null,10]

{"sheet":"About me","index":3,"n_rows":15,"n_cols":2,"rows_kept":15,"cut":false,"hidden":false,"merged":[]}
[{"$f":"txt(53+ROW(),_Lng)","v":"Company name"},"ExcelGuru.no"]
["VAT no","123456789 MVA"]
["Additional company info","Foretaksregisteret"]
["Contact name","Ketil"]
["Address","MyRoad 12"]
["Post no",1781]
["Place","Halden"]
["Cell phone",4799887766]
{"$rows_left_out":8}
{"sheet":"Language","index":4,"n_rows":91,"n_cols":96,"rows_kept":91,"cut":false,"hidden":false,"merged":[]}
["Afrikaans","Albanian","Amharic","Armenian","Azeerbaijani","Basque","Belarusian","Bengali","Bosnian","Bulgarian","Catalan","Cebuano","Chinese (Simplified)","Chinese (Traditional)","Corsican","Croatian","Czech","Danish","Dutch","English","Esperanto","Estonian","Finnish","French","Frisian","Galician","Georgian","German","Greek","Gujarati","Haitian Creole","Hausa","Hawaiian","Hindi","Hmong","Hungarian","Icelandic","Igbo","Indonesian","Irish","Italian","Japanese","Javanese","Kannada","Kazakh","Khmer","Korean","Kyrgyz","Lao","Latin","Latvian","Lithuanian","Luxembourgish","Macedonian","Malagasy","Malay","Malayalam","Maltese","Maori","Marathi","Mongolian","Myanmar (Burmese)","Nepali","Norwegian","Nyanja (Chichewa)","Polish","Portuguese (Portugal, Brazil)","Punjabi","Romanian","Russian","Samoan","Scots Gaelic","Serbian","Sesotho","Shona","Sinhala (Sinhalese)","Slovak","Slovenian","Somali","Spanish","Sundanese","Swahili","Swedish","Tagalog (Filipino)","Tajik","Tamil","Telugu","Thai","Turkish","Ukrainian","Uzbek","Vietnamese","Welsh","Xhosa","Yoruba","Zulu"]
["FAKTUUR","FATURA","INVOICE","INVOICE- ը","FAKTURA","FACTURA","КОШТ","চালান","FAKULTET","ФАКТУРА","FACTURA","INVOICE","INVOICE","INVOICE","INVOICE","DOSTAVNICA","FAKTURA","FAKTURA","FACTUUR","INVOICE","INVOZO","INVOICE","LASKU","FACTURE D'ACHAT","INVOICE","FACTURA","ინვოისი","RECHNUNG","ΤΙΜΟΛΟΓΙΟ","INVOICE","REVIZYON","GASKIYA","INVOICE","चालान","INVOICE","SZÁMLA","FJÁRFESTING","OBI","FAKTUR","INVOICE","FATTURA","請求書","INVOICE","INVOICE","INVOICE","INVOICE","송장","Эсеп-дүмүрчөк","INVOICE","INVOICE","INVOICE","SĄSKAITAS","INVOICE","ФИНАНСИРАЊЕ","faktiora","INVOICE","INVOICE","FATTURA","Tuhinga","INVOICE","INVOICE","ငွေတောင်းခံလွှာ","INVOICE","FAKTURA","INVOICE","FAKTURA","FATURA","INVOICE","FACTURA FISCALA","ВЫСТАВЛЕННЫЙ СЧЕТ","INVOICE","INVOICE","ФАКТУРА","INVOICE","INVOICE","ඉන්ෙවොයිසිය","Invoice","FAKTOR","INVOICE","FACTURA","paktur","INVOICE","FAKTURA","INVOICE","ИНТИХОБОТ","விலைப்பட்டியல்","వాయిస్","ใบแจ้งหนี้","FATURA","ВАРТОСТІ","INVOICE","HÓA ĐƠN","ARCHWILIO","INVOICE","NIPA","I-INVOICE"]
["KREDIET NOTA","SHËNIM KREDIT","የተሸጠ ዕቃ ሲመለስ የሚሰጥ ወረቀት","ՎԱՐԿԱՅԻՆ ԱՎԻԶՈ","KREDİT QEYDİ","KREDITU OHARRA","крэдытавых авізо","ক্রেডিট নোট","KREDITNA NAPOMENA","КРЕДИТНА БЕЛЕЖКА","NOTA DE CRÈDIT","TALANON SA CREDIT","Xìnyòng piàojù","Xìnyòng piàojù","CRITERIA","OBAVIJEST O KREDITU","DOBROPIS","KREDITNOTA","KREDIETNOTA","CREDIT NOTE","Kredito NOTO","KREDIIDILINE MÄRKUS","LUOTTORISUUS","NOTE DE CRÉDIT","CREDIT NOTE","NOTA DE CRÉDITO","საკრედიტო შენიშვნა","GUTSCHRIFT","ΠΙΣΤΩΤΙΚΟ ΣΗΜΕΙΩΜΑ","ઉધાર નોધ","KREDI NOTE","CREDIT NOTE","CREDIT NOTE","क्रेडिट नोट","CREDIT NOTE","JÓVÁÍRÁS","INNEIGNARNÓTU","AKWỤKWỌ AKWỤKWỌ","NOTA KREDIT","NÓTA CREIDMHEASA","NOTA DI CREDITO","クレジットメモ","CATETAN KREDIT","ಕ್ರೆಡಿಟ್ ಸೂಚನೆ","НЕСИЕ ЕСКЕРТПЕ","កំណត់ចំណាំឥណទាន","신용 노트","КРЕДИТ ЭСКЕРТҮҮ","CREDIT NOTE","CREDIT NOTE","KREDĪTA PIEZĪME","KREDITO PASTABA","GUTTSCHRËFT","КРЕДИТНА ЗАБЕЛЕШКА","AOKA IANAO","NOTA KREDIT","ക്രെഡിറ്റ് നോട്ട്","NOTA TA 'KREDITU","CREDIT NOTE","उधार पत्र","ЗАРИМ АСУУЛТ","Credit မှတ်ချက်","CREDIT नोट","Kreditnota","CREDIT NOTE","INFORMACJA KREDYTOWA","NOTA DE CRÉDITO","ਕਰੈਡਿਟ ਸੂਚਨਾ","NOTĂ DE CREDIT","КРЕДИТНАЯ ЗАПИСКА","FUAFUAGA MANATU","FIOSRACHADH CREDIT","КЊИЖНО","CREDIT NOTE","CREDIT NOTE","ණය විස්තරය","KREDITNÁ POZNÁMKA","DOBROPIS","FIIRO GAAR AH","NOTA DE CRÉDITO","kiridit CATETAN","CREDIT NOTE","KREDIT NOTE","TALAAN NG CREDIT","Ҳисоботи кредитӣ","கிரெடிட் குறிப்பு","క్రెడిట్ గమనిక","ใบลดหนี้","KREDİ NOTU","КРЕДИТОВЕ АВІЗО","KREDIT ESLATMA","GHI CHÚ TÍN DỤNG","NODYN CREDYD","ISAZISO SETYALA","AKIYESI OJU","INCWADI YESIKWELETU"]
["Kontak naam","Emri i kontaktit","የዕውቂያ ስም","Կոնտակտ անունը","Əlaqə adı","Harremanetarako Izena","кантактная асоба","যোগাযোগের নাম","Ime kontakta","Име за контакт","Nom de contacte","Pangalan sa kontak","Liánxì rén xìngmíng","Liánxì rén xìngmíng","U nome di cuntattu","Ime kontakta","Kontaktní jméno","Kontakt navn","Contactnaam","Contact name","Kontakto nomo","Kontaktisiku nimi","Yhteyshenkilön nimi","Nom du contact","Kontaktnamme","Nome de contacto","საკონტაქტო სახელი","Kontaktname","Ονομα επαφής","સંપર્ક નામ","Non kontak","Sunan tuntuɓa","Contact name","संपर्क नाम","Contact name","Kapcsolatfelvétel neve","Nafn tengiliðar","Aha aha","Nama Kontak","Ainm an Teagmhálaí","Nome del contatto","連絡先","Jeneng kontak","ಸಂಪರ್ಕಿಸುವ ಹೆಸರು","Байланысу аты","ឈ្មោះ​ទំនាក់ទំនង","담당자 이름","Байланыш аты-жөнү","ຊື່​ຕິດ​ຕໍ່","Nomen Contangionis","Kontakta vārds","Kontaktinis vardas","Kontaktnumm","Име за контакт","Contact name","Nama kenalan","കോൺടാക്റ്റ് പേര്","Isem tal-Kuntatt","Ingoa Whakapā","संपर्क नाव","Холбоо барих нэр","ဆက်သွယ်ရန်အမည်","संपर्क नाम","Kontakt navn","Dzina lalumikizidwe","Nazwa Kontaktu","Nome de contato","ਸੰਪਰਕ ਨਾਮ","Nume de contact","Контактное лицо","Igoa faʻafesoʻotaʻi","Cuir fios gu ainm","Контакт Име","Lebitso la lebitso","Zita rekubatana","ඇමතුම් නාමය","Kontaktné meno","Kontaktno ime","Magaca xiriirka","Nombre de contacto","ngaran kontak","Jina la mawasiliano","Kontaktnamn","Pangalan ng contact","Номи мухотиб","தொடர்பு பெயர்","సంప్రదింపు పేరు","ชื่อผู้ติดต่อ","İrtibat adı","Контактна Особа","Kontakt nomi","Tên Liên lạc","Enw cyswllt","Igama lokuqhagamshelwa","Orukọ olubasọrọ","Igama longaxhumana naye"]
["BTW No","TVSH nr","ተ.እ.ታ. ቁጥር","ԱԱՀ №","ƏDV No","BEZa ez","ПДВ,","কর নাম্বার","PDV br","ДДС номер","IVA no","VAT No","Zēngzhí shuì biānhào","Zēngzhí shuì biānhào","VAT No","PDV br","DPH č","Moms nr","btw nr","VAT No","VAT Ne","Mida ei","ALV","Numéro de TVA","VAT Nee","IVE non","დღგ არა","Umsatzsteuernummer","Αριθμός ΦΠΑ","વેટ નં","VAT Non","VAT A'a","VAT No","वैट नहीं","VAT No","ÁFA nélkül","VSK nr","VAT Mba","PPN No","Uimh. CBL","IVA n","付加価値税登録番号","PPN No","ವ್ಯಾಟ್ ಇಲ್ಲ","ҚҚС Жоқ","លេខពន្ធអាករ","부가가치세 없음","КНС табылган жок","VAT No","non LACUS","PVN Nr","PVM Nr","TVA Nee","ДДВ бр","VAT No","VAT No","വാറ്റ് നം","Nru tal-VAT","Tatau No","व्हॅट नंबर","НӨАТ-ын дугаар","VAT ကိုအဘယ်သူမျှမ","VAT No","Org.nr","VAT Ayi","VAT nie","VAT não","ਵੈਟ ਨੰ","TVA nr","НДС нет","Totogi Nu","Àireamh VAT","Пиб","Che. Ea VAT","VAT Kwete","අගය මත බදු අංකය","DPH č","DDV št","VAT Maya","IVA No","PPN No","No ya VAT","Momsregistreringsnummer","Hindi","VAT No","VAT எண்","VAT సంఖ్య","หมายเลข VAT","KDV No","ПДВ немає","QQS raqami","Số thuế GTGT","Rhif TAW","I-VAT","VAT Bẹẹkọ","I-VAT Ayikho"]
["Loopfoon","Telefon celular","ተንቀሳቃሽ ስልክ","Բջջային հեռախոս","Cib telefonu","Mugikorra","Мабільны тэлефон","মুঠোফোন","Mobitel","Мобилен телефон","Mòbil","Cell phone","Shǒujī","Shǒujī","Telefuninu","Mobitel","Mobilní telefon","Mobiltelefon","Mobiele telefoon","Cell phone","Poŝtelefono","Mobiiltelefon","Kännykkä","Téléphone portable","Mobile tillefoan","Teléfono móbil","მობილური ტელეფონი","Handy","Κινητό τηλέφωνο","સેલ ફોન","Telefòn selilè","Wayar salula","Cell phone","सेल फोन","Cell phone","Mobiltelefon","Farsími","Ekwentị","Telepon selular","Fón póca","Cellulare","携帯電話","Ponsel","ಸೆಲ್ ಫೋನ್","Ұялы телефон","ទូរស័ព្ទ​ចល័ត","휴대 전화","Уюлдук телефон","ໂທລະ​ສັບ​ມື​ຖື","cell phone","Mobilais telefons","Mobilusis telefonas","Handy","Мобилен телефон","Finday","Telefon bimbit","സെൽ ഫോൺ","Mowbajl","Waea Cell","सेल फोन","Гар утас","ဆဲလ်ဖုန်း","मोबाइल फोन","Mobiltelefon","Foni yam'manja","Komórka","Celular","ਮੋਬਾਇਲ ਫੋਨ","Telefon mobil","Сотовый телефон","Sela foni","Fòn-làimhe","Мобилни телефон","Lekolulo","Nharembozha","ජංගම දුරකථනය","Mobilný telefón","Mobitel","Taleefan gacanta","Teléfono móvil","Hapé","Simu ya mkononi","Mobiltelefon","Cell phone","Телефони мобилӣ","கைப்பேசி","సెల్ ఫోన్","โทรศัพท์มือถือ","Cep telefonu","Мобільний телефон","Uyali telefon","Điện thoại di động","Ffon symudol","Unomyayi","Foonu alagbeka","Umakhalekhukhwini"]
["bankrekening","Llogari bankare","የባንክ ሒሳብ","բանկային հաշիվ","Bank hesabı","Banku kontua","банкаўскі рахунак","ব্যাংক হিসাব","bankovni račun","банкова сметка","compte bancari","Akawnt sa bangko","Yínháng zhànghù","Yínháng zhànghù","Cuntu Bancu","bankovni račun","bankovní účet","bankkonto","bankrekening","Bank account","bankokonto","pangakonto","pankkitili","compte bancaire","bankrekken","conta bancaria","საბანკო ანგარიში","Bankkonto","τραπεζικός λογαριασμός","બેંક એકાઉન્ટ","Kont labank","Asusun bank","Bank account","बैंक खाता","Bank account","bankszámla","bankareikning","Akaụntụ Bank","akun bank","cuntas bainc","conto bancario","銀行口座","akun bank","ಬ್ಯಾಂಕ್ ಖಾತೆ","банк шоты","គណនីធនាគារ","은행 계좌","банк эсеби","ບັນ​ຊີ​ທະ​ນາ​ຄານ","patrimonio putent","bankas konts","banko sąskaita","Bankkonto","Банкарска сметка","Banky banky","akaun bank","ബാങ്ക് അക്കൗണ്ട്","Kont bankarju","Pūkete Bank","बँक खाते","банкны данс","ဘဏ်အကောင့်","बैंक खाता","Bankkonto","Konki ya banki","konto bankowe","conta bancária","ਬੈੰਕ ਖਾਤਾ","cont bancar","банковский счет","Faletupe Faletupe","cunntas banca","банковни рачун","Bonnete ea banka","Bhangi yebhangi","බැංකු ගිණුම","bankový účet","bančni račun","Koontada Bangiga","cuenta bancaria","akun bank","akaunti ya benki","bankkonto","Bank account","Ҳисоби бонкӣ","வங்கி கணக்கு","బ్యాంకు ఖాతా","บัญชีธนาคาร","banka hesabı","банківський рахунок","bank hisob raqami","tài khoản ngân hàng","cyfrif banc","i-akhawunti yebhanki","Ifowo iroyin","I-akhawunti yasebhange"]
["Kliëntnr","Nr i Klientit","የደንበኛ ቁጥር","Հաճախորդի համարը","Müştəri Xeyr","Bezeroak ez","заказчык Няма","গ্রাহক নং","Klijent br","Клиентски номер","Client no","Customer No","Kèhù biānhào","Kèhù biānhào","Cliente No","Br. Br","Zákazník č","Kunde nr","Klant Nr","Customer No","Kliento Ne","Kliendi nr","Asiakasnumero","No de client","Kunde Nee","Cliente non","დამკვეთი არ არის","Kunden-Nr","Αριθμός πελάτη","ગ્રાહક નંબર","Kliyan Non","Abokin ciniki Ba","Customer No","ग्राहक संख्या","Customer No","Ügyfélszám","Viðskiptavinur nr","Onye Ahịa","Nomor pelanggan","Uimh. Chustaiméara","Cliente n","顧客番号","Ora Ana Anggota","ಗ್ರಾಹಕ ಸಂಖ್ಯೆ","Тұтынушы №","អតិថិជនលេខ","고객 번호","Клиенттин номери","Customer No","Nulla elit","Klienta Nr","Kliento Nr","Client Nee","Клиент бр","Customer No","Nombor pelanggan","ഉപഭോക്താവ് ഇല്ല","Nru tal-Klijent","Kore Kaihoko","ग्राहक क्रमांक","Харилцагчийн дугаар","ဖောက်သည်အဘယ်သူမျှမ","ग्राहक संख्या","Kunde nr","Ayi Ayi","Numer klienta","Cliente Não","ਗਾਹਕ ਨੰਬਰ","Client nr","№ клиента","Leai Tagata Leai","Àireamh Luchd-ceannach","Клијент бр","Che. Ea bareki","Mutengesi Kwete","ගණුදෙනුකරුවන්ගේ අංකය","Zákaznícke číslo","Stranka št","Macaamiisha Maya","Ningún cliente","customer No","No ya Wateja","Kund nummer","Numero ng kustomer","Муштариёни мизоҷ","வாடிக்கையாளர் இல்லை","కస్టమర్ సంఖ్య","หมายเลขลูกค้า","Müşteri numarası","Замовник №","Xaridor No","Khách hàng Không","Rhif Cwsmer","NoThengi","Onibara Bẹẹkọ","Ikhomenti"]
{"$rows_left_out":84}
{"sheet":"Language table","index":5,"n_rows":97,"n_cols":4,"rows_kept":97,"cut":false,"hidden":true,"merged":[]}
["Language","Code","Selected"]
["Afrikaans","af"]
["Albanian","sq"]
["Amharic","am"]
["Armenian","hy"]
["Azeerbaijani","az"]
["Basque","eu"]
["Belarusian","be"]
{"$rows_left_out":90}
{"sheet":"Data","index":6,"n_rows":1,"n_cols":6,"rows_kept":1,"cut":false,"hidden":false,"merged":[]}
[{"$f":"txt(48,_Lng)","v":"Article no"},{"$f":"Parametre!E25","v":"English"},{"$f":"txt(49,_Lng)","v":"Description"},{"$f":"txt(50,_Lng)","v":"Unit"},{"$f":"txt(51,_Lng)","v":"Price"},{"$f":"txt(52,_Lng)","v":"VAT %"}]

{"sheet":"Parametre","index":7,"n_rows":120,"n_cols":8,"rows_kept":120,"cut":false,"hidden":false,"merged":[]}
["Invoice number",1021]
[]
[]
["First invoice number",1000]
["First article row",12]
["Last Article row",39]
["Article Column"]
[]
{"$rows_left_out":112}